Target
G-protein coupled receptor 55
Ligand
BDBM64827
Substrate
Meas. Tech.
SAR Analysis of Selective Antagonists of GPR55 using an Image-Based Assay
IC50
>32000±n/a nM
Citation
 PubChem, PC SAR Analysis of Selective Antagonists of GPR55 using an Image-Based Assay PubChem Bioassay (2010)[AID] 
Target
Name:
G-protein coupled receptor 55
Synonyms:
G protein-coupled receptor 55 GPR55_HUMAN
Type:
PROTEIN
Mol. Mass.:
36649.72
Organism:
Homo sapiens (Human)
Description:
ChEMBL_1292265
Residue:
319
  
Inhibitor
Name:
BDBM64827
Synonyms:
4-[(5Z)-5-benzal-4-keto-2-thioxo-thiazolidin-3-yl]-N-(4-hydroxyphenyl)butyramide MLS-0263798.0001 N-(4-hydroxyphenyl)-4-[(5Z)-4-oxo-5-(phenylmethylene)-2-sulfanylidene-3-thiazolidinyl]butanamide | cid_1416930
Type:
Small organic molecule
Emp. Form.:
C20H18N2O3S2
Mol. Mass.:
398.499
SMILES:
Oc1ccc(NC(=O)CCCN2C(=S)S\C(=C/c3ccccc3)C2=O)cc1
: