Target
Mu-type opioid receptor
Ligand
BDBM34699
Substrate
Meas. Tech.
Fluorescence-based biochemical high throughput dose response assay to identify inhibitors of Protein Phosphatase 1 (PP1)
IC50
>67047±n/a nM
Citation
 PubChem, PC Fluorescence-based biochemical high throughput dose response assay to identify inhibitors of Protein Phosphatase 1 (PP1) PubChem Bioassay (2010)[AID] 
Target
Name:
Mu-type opioid receptor
Synonyms:
M-OR-1 MOR-1 MUOR1 Mu opiate receptor OPRM1 hMOP | mu-type opioid receptor isoform MOR-1
Type:
G Protein-Coupled Receptor (GPCR)
Mol. Mass.:
44789.51
Organism:
Homo sapiens (Human)
Description:
P35372
Residue:
400
  
Inhibitor
Name:
BDBM34699
Synonyms:
3-(1-adamantyl)-5,6-bis(azanyl)-2-oxidanylidene-8-(3-oxidanylpiperidin-1-yl)-1H-pyrrolo[2,3-c][2,7]naphthyridine-9-carbonitrile 3-(1-adamantyl)-5,6-diamino-8-(3-hydroxypiperidin-1-yl)-2-oxo-1H-pyrrolo[2,3-c][2,7]naphthyridine-9-carbonitrile MLS000536166 cid_3962922
Type:
Small organic molecule
Emp. Form.:
C26H31N7O2
Mol. Mass.:
473.57
SMILES:
[H]C12CC3([H])CC([H])(C1)CC(C2)(C3)N1C(=O)Cc2c1nc(N)c1c(N)nc(N3CCCC(O)C3)c(C#N)c21
: