Target
Mu-type opioid receptor
Ligand
BDBM48816
Substrate
Meas. Tech.
Fluorescence-based biochemical high throughput dose response assay to identify inhibitors of Protein Phosphatase 1 (PP1)
IC50
7425±n/a nM
Citation
 PubChem, PC Fluorescence-based biochemical high throughput dose response assay to identify inhibitors of Protein Phosphatase 1 (PP1) PubChem Bioassay (2010)[AID] 
Target
Name:
Mu-type opioid receptor
Synonyms:
M-OR-1 MOR-1 MUOR1 Mu opiate receptor OPRM1 hMOP | mu-type opioid receptor isoform MOR-1
Type:
G Protein-Coupled Receptor (GPCR)
Mol. Mass.:
44789.51
Organism:
Homo sapiens (Human)
Description:
P35372
Residue:
400
  
Inhibitor
Name:
BDBM48816
Synonyms:
MLS000334839 N-[5-[(4-cyanophenyl)methylsulfanyl]-1,3,4-thiadiazol-2-yl]-1,3-benzothiazole-6-carboxamide SMR000249597 | cid_2452051
Type:
Small organic molecule
Emp. Form.:
C18H11N5OS3
Mol. Mass.:
409.508
SMILES:
O=C(Nc1nnc(SCc2ccc(cc2)C#N)s1)c1ccc2ncsc2c1
: