Target
Mu-type opioid receptor
Ligand
BDBM54791
Substrate
Meas. Tech.
Fluorescence-based biochemical high throughput dose response assay to identify inhibitors of Protein Phosphatase 1 (PP1)
IC50
6557±n/a nM
Citation
 PubChem, PC Fluorescence-based biochemical high throughput dose response assay to identify inhibitors of Protein Phosphatase 1 (PP1) PubChem Bioassay (2010)[AID] 
Target
Name:
Mu-type opioid receptor
Synonyms:
M-OR-1 MOR-1 MUOR1 Mu opiate receptor OPRM1 hMOP | mu-type opioid receptor isoform MOR-1
Type:
G Protein-Coupled Receptor (GPCR)
Mol. Mass.:
44789.51
Organism:
Homo sapiens (Human)
Description:
P35372
Residue:
400
  
Inhibitor
Name:
BDBM54791
Synonyms:
5-chloranyl-2-methoxy-N-[3-([1,2,4]triazolo[4,3-b]pyridazin-6-yl)phenyl]benzamide MLS000685766 cid_7217786
Type:
Small organic molecule
Emp. Form.:
C19H14ClN5O2
Mol. Mass.:
379.8
SMILES:
COc1ccc(Cl)cc1C(=O)Nc1cccc(c1)-c1ccc2nncn2n1
: