Target
Mu-type opioid receptor
Ligand
BDBM64858
Substrate
Meas. Tech.
Fluorescence-based biochemical high throughput dose response assay to identify inhibitors of Protein Phosphatase 1 (PP1)
IC50
6038±n/a nM
Citation
 PubChem, PC Fluorescence-based biochemical high throughput dose response assay to identify inhibitors of Protein Phosphatase 1 (PP1) PubChem Bioassay (2010)[AID] 
Target
Name:
Mu-type opioid receptor
Synonyms:
M-OR-1 MOR-1 MUOR1 Mu opiate receptor OPRM1 hMOP | mu-type opioid receptor isoform MOR-1
Type:
G Protein-Coupled Receptor (GPCR)
Mol. Mass.:
44789.51
Organism:
Homo sapiens (Human)
Description:
P35372
Residue:
400
  
Inhibitor
Name:
BDBM64858
Synonyms:
5-methoxy-4-(4-methoxyphenyl)sulfanyl-2-pyridin-2-yl-pyrimidine 5-methoxy-4-[(4-methoxyphenyl)sulfanyl]-2-(2-pyridinyl)pyrimidine 5-methoxy-4-[(4-methoxyphenyl)thio]-2-(2-pyridyl)pyrimidine SMR000333870 | cid_1487220
Type:
Small organic molecule
Emp. Form.:
C17H15N3O2S
Mol. Mass.:
325.385
SMILES:
COc1ccc(Sc2nc(ncc2OC)-c2ccccn2)cc1
: