Target
Mu-type opioid receptor
Ligand
BDBM55814
Substrate
Meas. Tech.
Fluorescence-based biochemical high throughput dose response assay to identify inhibitors of Protein Phosphatase 1 (PP1)
IC50
5604±n/a nM
Citation
 PubChem, PC Fluorescence-based biochemical high throughput dose response assay to identify inhibitors of Protein Phosphatase 1 (PP1) PubChem Bioassay (2010)[AID] 
Target
Name:
Mu-type opioid receptor
Synonyms:
M-OR-1 MOR-1 MUOR1 Mu opiate receptor OPRM1 hMOP | mu-type opioid receptor isoform MOR-1
Type:
G Protein-Coupled Receptor (GPCR)
Mol. Mass.:
44789.51
Organism:
Homo sapiens (Human)
Description:
P35372
Residue:
400
  
Inhibitor
Name:
BDBM55814
Synonyms:
5-[[5-(2,5-dichlorophenyl)-1H-pyrrol-2-yl]methylene]barbituric acid 5-[[5-[2,5-bis(chloranyl)phenyl]-1H-pyrrol-2-yl]methylidene]-1,3-diazinane-2,4,6-trione SMR000290453 | cid_5769678
Type:
Small organic molecule
Emp. Form.:
C15H9Cl2N3O3
Mol. Mass.:
350.156
SMILES:
Clc1ccc(Cl)c(c1)-c1ccc(C=C2C(=O)NC(=O)NC2=O)[nH]1
: