Target
Mu-type opioid receptor
Ligand
BDBM62183
Substrate
Meas. Tech.
SAR Analysis of Antagonists of the MOR Receptor using an Image-Based Assay
IC50
>32000±n/a nM
Citation
 PubChem, PC SAR Analysis of Antagonists of the MOR Receptor using an Image-Based Assay PubChem Bioassay (2010)[AID] 
Target
Name:
Mu-type opioid receptor
Synonyms:
M-OR-1 MOR-1 MUOR1 Mu opiate receptor OPRM1 hMOP | mu-type opioid receptor isoform MOR-1
Type:
G Protein-Coupled Receptor (GPCR)
Mol. Mass.:
44789.51
Organism:
Homo sapiens (Human)
Description:
P35372
Residue:
400
  
Inhibitor
Name:
BDBM62183
Synonyms:
MLS-0425691.0001 [4-[(4-methoxyphenyl)methyl]-1-[[1-(3-methylphenyl)-2-imidazolyl]methyl]-4-piperidinyl]methanol cid_44537712
Type:
Small organic molecule
Emp. Form.:
C25H31N3O2
Mol. Mass.:
405.5325
SMILES:
COc1ccc(CC2(CO)CCN(Cc3nccn3-c3cccc(C)c3)CC2)cc1
: