Target
Mu-type opioid receptor
Ligand
BDBM47739
Substrate
Meas. Tech.
SAR Analysis of Antagonists of the MOR Receptor using an Image-Based Assay
IC50
>32000±n/a nM
Citation
 PubChem, PC SAR Analysis of Antagonists of the MOR Receptor using an Image-Based Assay PubChem Bioassay (2010)[AID] 
Target
Name:
Mu-type opioid receptor
Synonyms:
M-OR-1 MOR-1 MUOR1 Mu opiate receptor OPRM1 hMOP | mu-type opioid receptor isoform MOR-1
Type:
G Protein-Coupled Receptor (GPCR)
Mol. Mass.:
44789.51
Organism:
Homo sapiens (Human)
Description:
P35372
Residue:
400
  
Inhibitor
Name:
BDBM47739
Synonyms:
MLS000586341 N-[1-(cyclohexylcarbamoyl)cyclohexyl]-N-(thiophen-2-ylmethyl)pyrazine-2-carboxamide N-{1-[(cyclohexylamino)carbonyl]cyclohexyl}-N-(thien-2-ylmethyl)pyrazine-2-carboxamide cid_4014737
Type:
Small organic molecule
Emp. Form.:
C23H30N4O2S
Mol. Mass.:
426.575
SMILES:
O=C(NC1CCCCC1)C1(CCCCC1)N(Cc1cccs1)C(=O)c1cnccn1
: