Target
Mu-type opioid receptor
Ligand
BDBM62206
Substrate
Meas. Tech.
SAR Analysis of Antagonists of the MOR Receptor using an Image-Based Assay
IC50
>32000±n/a nM
Citation
 PubChem, PC SAR Analysis of Antagonists of the MOR Receptor using an Image-Based Assay PubChem Bioassay (2010)[AID] 
Target
Name:
Mu-type opioid receptor
Synonyms:
M-OR-1 MOR-1 MUOR1 Mu opiate receptor OPRM1 hMOP | mu-type opioid receptor isoform MOR-1
Type:
G Protein-Coupled Receptor (GPCR)
Mol. Mass.:
44789.51
Organism:
Homo sapiens (Human)
Description:
P35372
Residue:
400
  
Inhibitor
Name:
BDBM62206
Synonyms:
MLS-0360328.0001 | cid_22553459
Type:
Small organic molecule
Emp. Form.:
C27H32N6O2
Mol. Mass.:
472.582
SMILES:
Cc1ccc(C)c(c1)N1CCN(CCCNC(=O)Cn2c3ncccc3n3cccc3c2=O)CC1
: