Target
G-protein coupled receptor 35
Ligand
BDBM59542
Substrate
Meas. Tech.
SAR analysis of compounds that inhibit NOD1 - Set 2
IC50
720±n/a nM
Citation
 PubChem, PC SAR analysis of compounds that inhibit NOD1 - Set 2 PubChem Bioassay (2010)[AID] 
Target
Name:
G-protein coupled receptor 35
Synonyms:
G protein-coupled receptor 35 GPR35_HUMAN
Type:
Enzyme Catalytic Domain
Mol. Mass.:
34085.57
Organism:
Homo sapiens (Human)
Description:
gi_33695097
Residue:
309
  
Inhibitor
Name:
BDBM59542
Synonyms:
(1-tosylbenzimidazol-2-yl)amine 1-(4-methylphenyl)sulfonylbenzimidazol-2-amine MLS001201458 cid_1088438
Type:
Small organic molecule
Emp. Form.:
C14H13N3O2S
Mol. Mass.:
287.337
SMILES:
Cc1ccc(cc1)S(=O)(=O)n1c(N)nc2ccccc12
: