Target
G-protein coupled receptor 35
Ligand
BDBM65729
Substrate
Meas. Tech.
SAR analysis of compounds that inhibit NOD1 - Set 2
IC50
935±n/a nM
Citation
 PubChem, PC SAR analysis of compounds that inhibit NOD1 - Set 2 PubChem Bioassay (2010)[AID] 
Target
Name:
G-protein coupled receptor 35
Synonyms:
G protein-coupled receptor 35 GPR35_HUMAN
Type:
Enzyme Catalytic Domain
Mol. Mass.:
34085.57
Organism:
Homo sapiens (Human)
Description:
gi_33695097
Residue:
309
  
Inhibitor
Name:
BDBM65729
Synonyms:
3-methyl-7-pentyl-8-(2-phenylethylsulfanyl)purine-2,6-dione 7-amyl-3-methyl-8-(phenethylthio)xanthine cid_647508
Type:
Small organic molecule
Emp. Form.:
C19H24N4O2S
Mol. Mass.:
372.484
SMILES:
CCCCCn1c(SCCc2ccccc2)nc2n(C)c(=O)[nH]c(=O)c12
: