Target
Nucleotide-binding oligomerization domain-containing protein 1
Ligand
BDBM64805
Substrate
Meas. Tech.
SAR analysis of Antagonists of the GPR35 Receptor using an Image-Based Assay - Set 2
IC50
>32000±n/a nM
Citation
 PubChem, PC SAR analysis of Antagonists of the GPR35 Receptor using an Image-Based Assay - Set 2 PubChem Bioassay (2010)[AID] 
Target
Name:
Nucleotide-binding oligomerization domain-containing protein 1
Synonyms:
CARD4 NOD1_HUMAN | nucleotide-binding oligomerization domain containing 1
Type:
Enzyme Catalytic Domain
Mol. Mass.:
107699.03
Organism:
Homo sapiens (Human)
Description:
gi_5174617
Residue:
953
  
Inhibitor
Name:
BDBM64805
Synonyms:
2-(4-methoxyphenyl)-5-(3-pyridinyl)-1,3,4-oxadiazole 2-(4-methoxyphenyl)-5-pyridin-3-yl-1,3,4-oxadiazole cid_865615
Type:
Small organic molecule
Emp. Form.:
C14H11N3O2
Mol. Mass.:
253.256
SMILES:
COc1ccc(cc1)-c1nnc(o1)-c1cccnc1
: