Target
Tumor necrosis factor
Ligand
BDBM54378
Substrate
Meas. Tech.
SAR analysis of inhibitors of TNFa specific NF-kB induction - Set 2
IC50
16900±n/a nM
Citation
 PubChem, PC SAR analysis of inhibitors of TNFa specific NF-kB induction - Set 2 PubChem Bioassay (2010)[AID] 
Target
Name:
Tumor necrosis factor
Synonyms:
Cachectin TNF-a TNFA TNFSF2 Tumor necrosis factor (TNFa) Tumor necrosis factor ligand superfamily member 2 Tumor necrosis factor, soluble form | tumor necrosis factor alpha
Type:
Enzyme
Mol. Mass.:
25645.11
Organism:
Homo sapiens (Human)
Description:
P01375
Residue:
233
  
Inhibitor
Name:
BDBM54378
Synonyms:
MLS001045934 N-[1-(2-chlorobenzyl)benzimidazol-2-yl]propionamide N-[1-[(2-chlorophenyl)methyl]benzimidazol-2-yl]propanamide cid_914315
Type:
Small organic molecule
Emp. Form.:
C17H16ClN3O
Mol. Mass.:
313.781
SMILES:
CCC(=O)Nc1nc2ccccc2n1Cc1ccccc1Cl
: