Target
Tumor necrosis factor
Ligand
BDBM46570
Substrate
Meas. Tech.
SAR analysis of inhibitors of TNFa specific NF-kB induction - Set 2
IC50
>20000±n/a nM
Citation
 PubChem, PC SAR analysis of inhibitors of TNFa specific NF-kB induction - Set 2 PubChem Bioassay (2010)[AID] 
Target
Name:
Tumor necrosis factor
Synonyms:
Cachectin TNF-a TNFA TNFSF2 Tumor necrosis factor (TNFa) Tumor necrosis factor ligand superfamily member 2 Tumor necrosis factor, soluble form | tumor necrosis factor alpha
Type:
Enzyme
Mol. Mass.:
25645.11
Organism:
Homo sapiens (Human)
Description:
P01375
Residue:
233
  
Inhibitor
Name:
BDBM46570
Synonyms:
2-[(2,5-dimethylphenyl)thio]acetic acid [3-cyano-3-(1,3-dihydrobenzimidazol-2-ylidene)-2-keto-propyl] ester MLS000392255 [3-cyano-3-(1,3-dihydrobenzimidazol-2-ylidene)-2-oxidanylidene-propyl] 2-(2,5-dimethylphenyl)sulfanylethanoate cid_5683259
Type:
Small organic molecule
Emp. Form.:
C21H19N3O3S
Mol. Mass.:
393.459
SMILES:
Cc1ccc(C)c(SCC(=O)OCC(=O)C(C#N)c2nc3ccccc3[nH]2)c1
: