Target
Tumor necrosis factor
Ligand
BDBM65732
Substrate
Meas. Tech.
SAR analysis of inhibitors of TNFa specific NF-kB induction - Set 2
IC50
>20000±n/a nM
Citation
 PubChem, PC SAR analysis of inhibitors of TNFa specific NF-kB induction - Set 2 PubChem Bioassay (2010)[AID] 
Target
Name:
Tumor necrosis factor
Synonyms:
Cachectin TNF-a TNFA TNFSF2 Tumor necrosis factor (TNFa) Tumor necrosis factor ligand superfamily member 2 Tumor necrosis factor, soluble form | tumor necrosis factor alpha
Type:
Enzyme
Mol. Mass.:
25645.11
Organism:
Homo sapiens (Human)
Description:
P01375
Residue:
233
  
Inhibitor
Name:
BDBM65732
Synonyms:
7-(2-methoxyethyl)-3-methyl-8-(3-phenylpropylsulfanyl)purine-2,6-dione 7-(2-methoxyethyl)-3-methyl-8-(3-phenylpropylthio)xanthine cid_652751
Type:
Small organic molecule
Emp. Form.:
C18H22N4O3S
Mol. Mass.:
374.457
SMILES:
COCCn1c(SCCCc2ccccc2)nc2n(C)c(=O)[nH]c(=O)c12
: