Target
Amyloid-beta A4 precursor protein-binding family A member 1
Ligand
BDBM65764
Substrate
Meas. Tech.
SAR analysis of small molecule inhibitors of Mint-PDZ and N-type Ca2+ channel carboxyl-terminal peptide association using HTRF
IC50
>56800±n/a nM
Citation
 PubChem, PC SAR analysis of small molecule inhibitors of Mint-PDZ and N-type Ca2+ channel carboxyl-terminal peptide association using HTRF PubChem Bioassay (2010)[AID] 
Target
Name:
Amyloid-beta A4 precursor protein-binding family A member 1
Synonyms:
APBA1_RAT Mint1 neuronal munc18-1 binding protein
Type:
Enzyme Catalytic Domain
Mol. Mass.:
92603.32
Organism:
Rattus norvegicus
Description:
gi_2625023
Residue:
839
  
Inhibitor
Name:
BDBM65764
Synonyms:
2-(2-furanyl)-4-quinolinecarboxylic acid [2-(3,4-dihydro-1H-isoquinolin-2-yl)-2-oxoethyl] ester MLS-0315880.0001 [2-(3,4-dihydro-1H-isoquinolin-2-yl)-2-oxoethyl] 2-(furan-2-yl)quinoline-4-carboxylate | cid_7395396
Type:
Small organic molecule
Emp. Form.:
C25H20N2O4
Mol. Mass.:
412.4373
SMILES:
O=C(COC(=O)c1cc(nc2ccccc12)-c1ccco1)N1CCc2ccccc2C1
: