Target
Amyloid-beta A4 precursor protein-binding family A member 1
Ligand
BDBM65779
Substrate
Meas. Tech.
SAR analysis of small molecule inhibitors of Mint-PDZ and N-type Ca2+ channel carboxyl-terminal peptide association using HTRF
IC50
>56800±n/a nM
Citation
 PubChem, PC SAR analysis of small molecule inhibitors of Mint-PDZ and N-type Ca2+ channel carboxyl-terminal peptide association using HTRF PubChem Bioassay (2010)[AID] 
Target
Name:
Amyloid-beta A4 precursor protein-binding family A member 1
Synonyms:
APBA1_RAT Mint1 neuronal munc18-1 binding protein
Type:
Enzyme Catalytic Domain
Mol. Mass.:
92603.32
Organism:
Rattus norvegicus
Description:
gi_2625023
Residue:
839
  
Inhibitor
Name:
BDBM65779
Synonyms:
2-(2-furanyl)-4-quinolinecarboxylic acid [3-[(2-methoxyphenyl)methylamino]-3-oxopropyl] ester MLS-0315916.0001 [3-[(2-methoxyphenyl)methylamino]-3-oxopropyl] 2-(furan-2-yl)quinoline-4-carboxylate | cid_25181197
Type:
Small organic molecule
Emp. Form.:
C25H22N2O5
Mol. Mass.:
430.4526
SMILES:
COc1ccccc1CNC(=O)CCOC(=O)c1cc(nc2ccccc12)-c1ccco1
: