Target
Amyloid-beta A4 precursor protein-binding family A member 1
Ligand
BDBM65786
Substrate
Meas. Tech.
SAR analysis of small molecule inhibitors of Mint-PDZ and N-type Ca2+ channel carboxyl-terminal peptide association using HTRF
IC50
>56800±n/a nM
Citation
 PubChem, PC SAR analysis of small molecule inhibitors of Mint-PDZ and N-type Ca2+ channel carboxyl-terminal peptide association using HTRF PubChem Bioassay (2010)[AID] 
Target
Name:
Amyloid-beta A4 precursor protein-binding family A member 1
Synonyms:
APBA1_RAT Mint1 neuronal munc18-1 binding protein
Type:
Enzyme Catalytic Domain
Mol. Mass.:
92603.32
Organism:
Rattus norvegicus
Description:
gi_2625023
Residue:
839
  
Inhibitor
Name:
BDBM65786
Synonyms:
2-(2-furanyl)-N-(2-phenylethyl)-4-quinolinecarboxamide 2-(furan-2-yl)-N-(2-phenylethyl)quinoline-4-carboxamide cid_5080992
Type:
Small organic molecule
Emp. Form.:
C22H18N2O2
Mol. Mass.:
342.3905
SMILES:
O=C(NCCc1ccccc1)c1cc(nc2ccccc12)-c1ccco1
: