Target
Mu-type opioid receptor
Ligand
BDBM65819
Substrate
Meas. Tech.
SAR Analysis of Agonists of the MOR Receptor using an Image-Based Assay - Set 2
EC50
>32000±n/a nM
Citation
 PubChem, PC SAR Analysis of Agonists of the MOR Receptor using an Image-Based Assay - Set 2 PubChem Bioassay (2010)[AID] 
Target
Name:
Mu-type opioid receptor
Synonyms:
M-OR-1 MOR-1 MUOR1 Mu opiate receptor OPRM1 hMOP | mu-type opioid receptor isoform MOR-1
Type:
G Protein-Coupled Receptor (GPCR)
Mol. Mass.:
44789.51
Organism:
Homo sapiens (Human)
Description:
P35372
Residue:
400
  
Inhibitor
Name:
BDBM65819
Synonyms:
2-[4-(2-furanylmethyl)-5-[(4-methylphenyl)methylthio]-1,2,4-triazol-3-yl]pyridine 2-[4-(furan-2-ylmethyl)-5-[(4-methylphenyl)methylsulfanyl]-1,2,4-triazol-3-yl]pyridine KUC103895N | cid_44601474
Type:
Small organic molecule
Emp. Form.:
C20H18N4OS
Mol. Mass.:
362.448
SMILES:
Cc1ccc(CSc2nnc(-c3ccccn3)n2Cc2ccco2)cc1
: