Target
Kappa-type opioid receptor
Ligand
BDBM65829
Substrate
Meas. Tech.
SAR analysis of Agonists of the Kappa Opioid Receptor (KOR) using an Image-Based Assay - Set 2
EC50
>32000±n/a nM
Citation
 PubChem, PC SAR analysis of Agonists of the Kappa Opioid Receptor (KOR) using an Image-Based Assay - Set 2 PubChem Bioassay (2010)[AID] 
Target
Name:
Kappa-type opioid receptor
Synonyms:
K-OR-1 Kappa-opioid receptor (KOR) Kappa-type opioid receptor (KOR) OPIATE Kappa OPRK1 kappa opioid receptor (KOR)
Type:
G Protein-Coupled Receptor (GPCR)
Mol. Mass.:
42648.76
Organism:
Homo sapiens (Human)
Description:
P41145
Residue:
380
  
Inhibitor
Name:
BDBM65829
Synonyms:
4-[[(4-ethylphenyl)sulfonylamino]methyl]-N-(2-phenylethyl)benzamide KSC-5-236 cid_44601477
Type:
Small organic molecule
Emp. Form.:
C24H26N2O3S
Mol. Mass.:
422.54
SMILES:
CCc1ccc(cc1)S(=O)(=O)NCc1ccc(cc1)C(=O)NCCc1ccccc1
: