Target
Interleukin-8
Ligand
BDBM65733
Substrate
Meas. Tech.
SAR analysis of GM-Tri-DAP induced IL-8 secretion in MCF-7/NOD1 cells - Set 2
IC50
2156±689 nM
Citation
 PubChem, PC SAR analysis of GM-Tri-DAP induced IL-8 secretion in MCF-7/NOD1 cells - Set 2 PubChem Bioassay (2010)[AID] 
Target
Name:
Interleukin-8
Synonyms:
CXCL8 IL8_HUMAN interleukin 8 precursor
Type:
PROTEIN
Mol. Mass.:
11104.05
Organism:
Homo sapiens (Human)
Description:
ChEMBL_577736
Residue:
99
  
Inhibitor
Name:
BDBM65733
Synonyms:
3-methyl-8-nitro-7-(phenylmethyl)purine-2,6-dione 7-benzyl-3-methyl-8-nitropurine-2,6-dione cid_909915
Type:
Small organic molecule
Emp. Form.:
C13H11N5O4
Mol. Mass.:
301.2575
SMILES:
Cn1c2nc(n(Cc3ccccc3)c2c(=O)[nH]c1=O)[N+]([O-])=O
: