Target
Glucose-6-phosphate 1-dehydrogenase
Ligand
BDBM46695
Substrate
Meas. Tech.
G6DPH counterscreen for TbHK1 inhibitors - Analogues series
IC50
>25000±n/a nM
Citation
 PubChem, PC G6DPH counterscreen for TbHK1 inhibitors - Analogues series PubChem Bioassay (2010)[AID] 
Target
Name:
Glucose-6-phosphate 1-dehydrogenase
Synonyms:
G6PD_LEUME zwf
Type:
Enzyme Catalytic Domain
Mol. Mass.:
54421.26
Organism:
Leuconostoc mesenteroides
Description:
gi_149631
Residue:
486
  
Inhibitor
Name:
BDBM46695
Synonyms:
2-(3-chlorophenyl)-1,2-benzothiazol-3-one cid_13186954
Type:
Small organic molecule
Emp. Form.:
C13H8ClNOS
Mol. Mass.:
261.727
SMILES:
Clc1cccc(c1)-n1sc2ccccc2c1=O
: