Target
Glucose-6-phosphate 1-dehydrogenase
Ligand
BDBM34737
Substrate
Meas. Tech.
G6DPH counterscreen for TbHK1 inhibitors - Analogues series
IC50
>25000±n/a nM
Citation
 PubChem, PC G6DPH counterscreen for TbHK1 inhibitors - Analogues series PubChem Bioassay (2010)[AID] 
Target
Name:
Glucose-6-phosphate 1-dehydrogenase
Synonyms:
G6PD_LEUME zwf
Type:
Enzyme Catalytic Domain
Mol. Mass.:
54421.26
Organism:
Leuconostoc mesenteroides
Description:
gi_149631
Residue:
486
  
Inhibitor
Name:
BDBM34737
Synonyms:
2-(4-methylphenyl)-1,2-benzisothiazol-3(2H)-one 2-(p-tolyl)-1,2-benzothiazol-3-one SMR000200989 cid_935415
Type:
Small organic molecule
Emp. Form.:
C14H11NOS
Mol. Mass.:
241.308
SMILES:
Cc1ccc(cc1)-n1sc2ccccc2c1=O
: