Target
Glucose-6-phosphate 1-dehydrogenase
Ligand
BDBM61968
Substrate
Meas. Tech.
G6DPH counterscreen for TbHK1 inhibitors - Analogues series
IC50
>25000±n/a nM
Citation
 PubChem, PC G6DPH counterscreen for TbHK1 inhibitors - Analogues series PubChem Bioassay (2010)[AID] 
Target
Name:
Glucose-6-phosphate 1-dehydrogenase
Synonyms:
G6PD_LEUME zwf
Type:
Enzyme Catalytic Domain
Mol. Mass.:
54421.26
Organism:
Leuconostoc mesenteroides
Description:
gi_149631
Residue:
486
  
Inhibitor
Name:
BDBM61968
Synonyms:
KSC-09-140A N-(2-cyanophenyl)-2-(3-keto-1,2-benzothiazol-2-yl)acetamide N-(2-cyanophenyl)-2-(3-oxo-1,2-benzothiazol-2-yl)acetamide | cid_45479200
Type:
Small organic molecule
Emp. Form.:
C16H11N3O2S
Mol. Mass.:
309.342
SMILES:
O=C(Cn1sc2ccccc2c1=O)Nc1ccccc1C#N
: