Target
Glucose-6-phosphate 1-dehydrogenase
Ligand
BDBM62001
Substrate
Meas. Tech.
G6DPH counterscreen for TbHK1 inhibitors - Analogues series
IC50
>25000±n/a nM
Citation
 PubChem, PC G6DPH counterscreen for TbHK1 inhibitors - Analogues series PubChem Bioassay (2010)[AID] 
Target
Name:
Glucose-6-phosphate 1-dehydrogenase
Synonyms:
G6PD_LEUME zwf
Type:
Enzyme Catalytic Domain
Mol. Mass.:
54421.26
Organism:
Leuconostoc mesenteroides
Description:
gi_149631
Residue:
486
  
Inhibitor
Name:
BDBM62001
Synonyms:
4-chloranyl-2-[(4-ethylphenyl)carbonylamino]benzoic acid 4-chloro-2-[[(4-ethylphenyl)-oxomethyl]amino]benzoic acid KUC105913N | cid_25734182
Type:
Small organic molecule
Emp. Form.:
C16H14ClNO3
Mol. Mass.:
303.74
SMILES:
CCc1ccc(cc1)C(=O)Nc1cc(Cl)ccc1C(O)=O
: