Target
Glucose-6-phosphate 1-dehydrogenase
Ligand
BDBM62016
Substrate
Meas. Tech.
G6DPH counterscreen for TbHK1 inhibitors - Analogues series
IC50
>25000±n/a nM
Citation
 PubChem, PC G6DPH counterscreen for TbHK1 inhibitors - Analogues series PubChem Bioassay (2010)[AID] 
Target
Name:
Glucose-6-phosphate 1-dehydrogenase
Synonyms:
G6PD_LEUME zwf
Type:
Enzyme Catalytic Domain
Mol. Mass.:
54421.26
Organism:
Leuconostoc mesenteroides
Description:
gi_149631
Residue:
486
  
Inhibitor
Name:
BDBM62016
Synonyms:
4-chloranyl-2-(pyridin-4-ylcarbonylamino)benzoic acid 4-chloro-2-[[oxo(pyridin-4-yl)methyl]amino]benzoic acid KSC-09-193 cid_16771558
Type:
Small organic molecule
Emp. Form.:
C13H9ClN2O3
Mol. Mass.:
276.675
SMILES:
OC(=O)c1ccc(Cl)cc1NC(=O)c1ccncc1
: