Target
Ion channel NompC
Ligand
BDBM46863
Substrate
Meas. Tech.
Late stage counterscreen for the probe development effort to identify selective agonists of the Transient Receptor Potential Channels 3 (TRPML3)
EC50
>29900±n/a nM
Citation
 PubChem, PC Late stage counterscreen for the probe development effort to identify selective agonists of the Transient Receptor Potential Channels 3 (TRPML3): fluorescence-based cell-based dose response assay for TRPN1 agonists. PubChem Bioassay (2010)[AID] 
Target
Name:
Ion channel NompC
Synonyms:
transient receptor potential cation channel, subfamily N, member 1
Type:
Enzyme Catalytic Domain
Mol. Mass.:
175824.78
Organism:
Danio rerio
Description:
Q7T1G6
Residue:
1614
  
Inhibitor
Name:
BDBM46863
Synonyms:
1-(4-Ethoxy-naphthalene-1-sulfonyl)-azepane 1-[(4-ethoxy-1-naphthalenyl)sulfonyl]azepane MLS000123160 cid_776924
Type:
Small organic molecule
Emp. Form.:
C18H23NO3S
Mol. Mass.:
333.445
SMILES:
CCOc1ccc(c2ccccc12)S(=O)(=O)N1CCCCCC1
: