Target
Inward rectifier potassium channel 2
Ligand
BDBM65865
Substrate
Meas. Tech.
Confirmation dose response assay for compounds that inhibit/block inward-rectifying potassium ion channel Kir2.1
IC50
22296±23651 nM
Citation
 PubChem, PC Confirmation dose response assay for compounds that inhibit/block inward-rectifying potassium ion channel Kir2.1 PubChem Bioassay (2010)[AID] 
Target
Name:
Inward rectifier potassium channel 2
Synonyms:
Irk1 Kcnj2 | inward rectifier potassium channel 2
Type:
Enzyme Catalytic Domain
Mol. Mass.:
48383.35
Organism:
Mus musculus
Description:
gi_6680530
Residue:
428
  
Inhibitor
Name:
BDBM65865
Synonyms:
(E)-N-[(4-methoxyphenyl)methyl]-3-phenyl-2-propen-1-amine;hydrochloride (E)-N-[(4-methoxyphenyl)methyl]-3-phenylprop-2-en-1-amine;hydrochloride N-(4-methoxybenzyl)-3-phenyl-2-propen-1-amine hydrochloride [(E)-cinnamyl]-p-anisyl-amine;hydrochloride | cid_6464138
Type:
Small organic molecule
Emp. Form.:
C17H19NO
Mol. Mass.:
253.3389
SMILES:
COc1ccc(CNC\C=C\c2ccccc2)cc1
: