Target
Muscarinic acetylcholine receptor M1
Ligand
BDBM65916
Substrate
Meas. Tech.
Discovery of Novel Allosteric Modulators of the M1 Muscarinic Receptor: PAM Calcium Assay SAR
EC50
5220±n/a nM
Citation
 PubChem, PC Discovery of Novel Allosteric Modulators of the M1 Muscarinic Receptor: PAM Calcium Assay SAR PubChem Bioassay (2010)[AID] 
Target
Name:
Muscarinic acetylcholine receptor M1
Synonyms:
ACM1_RAT Chrm-1 cholinergic receptor, muscarinic 1
Type:
Enzyme Catalytic Domain
Mol. Mass.:
51390.46
Organism:
RAT
Description:
P08482
Residue:
460
  
Inhibitor
Name:
BDBM65916
Synonyms:
2-[1-(3-fluorobenzyl)indol-3-yl]sulfonyl-N-(5-methylisoxazol-3-yl)acetamide 2-[1-[(3-fluorophenyl)methyl]indol-3-yl]sulfonyl-N-(5-methyl-1,2-oxazol-3-yl)ethanamide VU0165202-4 | cid_2157612
Type:
Small organic molecule
Emp. Form.:
C21H18FN3O4S
Mol. Mass.:
427.449
SMILES:
Cc1cc(NC(=O)CS(=O)(=O)c2cn(Cc3cccc(F)c3)c3ccccc23)no1
: