Target
1,5-anhydro-D-fructose reductase
Ligand
BDBM50119583
Substrate
Meas. Tech.
Fatty Acid Synthase Keto-reductase Domain (FASN KR) Inhibition
pH
7.5±n/a
Temperature
298.15±n/a K
IC50
324±n/a nM
Comments
extracted
Citation
 Connolly, PJLu, T Imidazolin-5-one derivative useful as FASN inhibitors for the treatment of cancer US Patent  US9718813 Publication Date 8/1/2017 
Target
Name:
1,5-anhydro-D-fructose reductase
Synonyms:
AF reductase AKR1CL2 AKRDC1 Aldo-keto reductase family 1 member E2 | LoopADR
Type:
Enzyme Catalytic Domain
Mol. Mass.:
36595.42
Organism:
Homo sapiens (Human)
Description:
Q96JD6
Residue:
320
  
Inhibitor
Name:
BDBM50119583
Synonyms:
CHEMBL3617744 US9718813, Compound 53
Type:
Small organic molecule
Emp. Form.:
C28H30FN5O2
Mol. Mass.:
487.5685
SMILES:
Cn1ncc2cc(ccc12)-c1ccc(C2=NC(C)(C)C(=O)N2C[C@@H]2CCN(C2)C(=O)C2CC2)c(F)c1
: