Target
Potassium voltage-gated channel subfamily KQT member 2
Ligand
BDBM65938
Substrate
Meas. Tech.
Dose response of Retigabine-insensitive compounds that potentiate KCNQ2 potassium channel
EC50
13650±4670 nM
Citation
 PubChem, PC Dose response of Retigabine-insensitive compounds that potentiate KCNQ2 potassium channel PubChem Bioassay (2011)[AID] 
Target
Name:
Potassium voltage-gated channel subfamily KQT member 2
Synonyms:
KCNQ2_RAT Voltage-gated potassium channel subunit Kv7.2 | potassium voltage-gated channel, KQT-like subfamily, member 2
Type:
PROTEIN
Mol. Mass.:
93984.01
Organism:
Rattus norvegicus
Description:
EBI_100117
Residue:
852
  
Inhibitor
Name:
BDBM65938
Synonyms:
1-(4-butylphenyl)-3-(3-pyridinyl)urea 1-(4-butylphenyl)-3-pyridin-3-yl-urea VU0414998-1 | cid_6464443
Type:
Small organic molecule
Emp. Form.:
C16H19N3O
Mol. Mass.:
269.3416
SMILES:
CCCCc1ccc(NC(=O)Nc2cccnc2)cc1
: