Target
Potassium voltage-gated channel subfamily KQT member 2
Ligand
BDBM65941
Substrate
Meas. Tech.
Dose response of Retigabine-insensitive compounds that potentiate KCNQ2 potassium channel
EC50
10690±3520 nM
Citation
 PubChem, PC Dose response of Retigabine-insensitive compounds that potentiate KCNQ2 potassium channel PubChem Bioassay (2011)[AID] 
Target
Name:
Potassium voltage-gated channel subfamily KQT member 2
Synonyms:
KCNQ2_RAT Voltage-gated potassium channel subunit Kv7.2 | potassium voltage-gated channel, KQT-like subfamily, member 2
Type:
PROTEIN
Mol. Mass.:
93984.01
Organism:
Rattus norvegicus
Description:
EBI_100117
Residue:
852
  
Inhibitor
Name:
BDBM65941
Synonyms:
1-(3,5-dimethylphenyl)-3-(3-pyridinyl)urea 1-(3,5-dimethylphenyl)-3-pyridin-3-yl-urea VU0415006-1 | cid_2815695
Type:
Small organic molecule
Emp. Form.:
C14H15N3O
Mol. Mass.:
241.2884
SMILES:
Cc1cc(C)cc(NC(=O)Nc2cccnc2)c1
: