Target
Potassium voltage-gated channel subfamily KQT member 2
Ligand
BDBM65942
Substrate
Meas. Tech.
Dose response of Retigabine-insensitive compounds that potentiate KCNQ2 potassium channel
EC50
16810±9560 nM
Citation
 PubChem, PC Dose response of Retigabine-insensitive compounds that potentiate KCNQ2 potassium channel PubChem Bioassay (2011)[AID] 
Target
Name:
Potassium voltage-gated channel subfamily KQT member 2
Synonyms:
KCNQ2_RAT Voltage-gated potassium channel subunit Kv7.2 | potassium voltage-gated channel, KQT-like subfamily, member 2
Type:
PROTEIN
Mol. Mass.:
93984.01
Organism:
Rattus norvegicus
Description:
EBI_100117
Residue:
852
  
Inhibitor
Name:
BDBM65942
Synonyms:
1-(3-methylphenyl)-3-(3-pyridinyl)urea 1-(3-methylphenyl)-3-pyridin-3-ylurea VU0415007-1 | cid_667672
Type:
Small organic molecule
Emp. Form.:
C13H13N3O
Mol. Mass.:
227.2618
SMILES:
Cc1cccc(NC(=O)Nc2cccnc2)c1
: