Target
Potassium voltage-gated channel subfamily KQT member 2
Ligand
BDBM65946
Substrate
Meas. Tech.
Dose response of Retigabine-insensitive compounds that potentiate KCNQ2 potassium channel
EC50
5760±2470 nM
Citation
 PubChem, PC Dose response of Retigabine-insensitive compounds that potentiate KCNQ2 potassium channel PubChem Bioassay (2011)[AID] 
Target
Name:
Potassium voltage-gated channel subfamily KQT member 2
Synonyms:
KCNQ2_RAT Voltage-gated potassium channel subunit Kv7.2 | potassium voltage-gated channel, KQT-like subfamily, member 2
Type:
PROTEIN
Mol. Mass.:
93984.01
Organism:
Rattus norvegicus
Description:
EBI_100117
Residue:
852
  
Inhibitor
Name:
BDBM65946
Synonyms:
1-(3-fluorophenyl)-3-(6-fluoro-3-pyridinyl)urea 1-(3-fluorophenyl)-3-(6-fluoropyridin-3-yl)urea VU0417937-1 | cid_45489573
Type:
Small organic molecule
Emp. Form.:
C12H9F2N3O
Mol. Mass.:
249.2162
SMILES:
Fc1cccc(NC(=O)Nc2ccc(F)nc2)c1
: