Target
Potassium voltage-gated channel subfamily KQT member 2
Ligand
BDBM65949
Substrate
Meas. Tech.
Dose response of Retigabine-insensitive compounds that potentiate KCNQ2 potassium channel
EC50
4040±670 nM
Citation
 PubChem, PC Dose response of Retigabine-insensitive compounds that potentiate KCNQ2 potassium channel PubChem Bioassay (2011)[AID] 
Target
Name:
Potassium voltage-gated channel subfamily KQT member 2
Synonyms:
KCNQ2_RAT Voltage-gated potassium channel subunit Kv7.2 | potassium voltage-gated channel, KQT-like subfamily, member 2
Type:
PROTEIN
Mol. Mass.:
93984.01
Organism:
Rattus norvegicus
Description:
EBI_100117
Residue:
852
  
Inhibitor
Name:
BDBM65949
Synonyms:
1-(6-bromanylpyridin-3-yl)-3-(3-fluorophenyl)urea 1-(6-bromo-3-pyridyl)-3-(3-fluorophenyl)urea VU0417942-1 | cid_45489578
Type:
Small organic molecule
Emp. Form.:
C12H9BrFN3O
Mol. Mass.:
310.122
SMILES:
Fc1cccc(NC(=O)Nc2ccc(Br)nc2)c1
: