Target
NADPH oxidase 1
Ligand
BDBM61055
Substrate
Meas. Tech.
Late-stage luminescence-based cell-based dose response assay to identify inhibitors of NADPH oxidase 1 (NOX1): Synthesized analogs
IC50
>50000±n/a nM
Citation
 PubChem, PC Late-stage luminescence-based cell-based dose response assay to identify inhibitors of NADPH oxidase 1 (NOX1): Synthesized analogs PubChem Bioassay (2010)[AID] 
Target
Name:
NADPH oxidase 1
Synonyms:
MOX-1 Mitogenic oxidase 1 NOH-1 NOX-1 NOX1_HUMAN
Type:
PROTEIN
Mol. Mass.:
64890.44
Organism:
Homo sapiens (Human)
Description:
ChEMBL_792877
Residue:
564
  
Inhibitor
Name:
BDBM61055
Synonyms:
2-(1,3-benzoxazol-2-ylsulfanyl)-1-[2-(trifluoromethyl)phenothiazin-10-yl]ethanone 2-(1,3-benzoxazol-2-ylthio)-1-[2-(trifluoromethyl)phenothiazin-10-yl]ethanone MLS000562755 cid_1724901
Type:
Small organic molecule
Emp. Form.:
C22H13F3N2O2S2
Mol. Mass.:
458.476
SMILES:
FC(F)(F)c1ccc2Sc3ccccc3N(C(=O)CSc3nc4ccccc4o3)c2c1
: