Target
NADPH oxidase 1
Ligand
BDBM65957
Substrate
Meas. Tech.
Late-stage luminescence-based cell-based dose response assay to identify inhibitors of NADPH oxidase 1 (NOX1): Synthesized analogs
IC50
1471±n/a nM
Citation
 PubChem, PC Late-stage luminescence-based cell-based dose response assay to identify inhibitors of NADPH oxidase 1 (NOX1): Synthesized analogs PubChem Bioassay (2010)[AID] 
Target
Name:
NADPH oxidase 1
Synonyms:
MOX-1 Mitogenic oxidase 1 NOH-1 NOX-1 NOX1_HUMAN
Type:
PROTEIN
Mol. Mass.:
64890.44
Organism:
Homo sapiens (Human)
Description:
ChEMBL_792877
Residue:
564
  
Inhibitor
Name:
BDBM65957
Synonyms:
10-methyl-7H-benzo[c]phenothiazine SR-01000767900-3 | cid_237061
Type:
Small organic molecule
Emp. Form.:
C17H13NS
Mol. Mass.:
263.357
SMILES:
Cc1ccc2Nc3ccc4ccccc4c3Sc2c1
: