Target
Tyrosine-protein phosphatase non-receptor type 22
Ligand
BDBM65965
Substrate
Meas. Tech.
SAR LYP1 Fluorescent Assay using pCAP substrate for In Vitro dose response studies - Set 2
IC50
>100000±n/a nM
Citation
 PubChem, PC SAR LYP1 Fluorescent Assay using pCAP substrate for In Vitro dose response studies - Set 2 PubChem Bioassay (2010)[AID] 
Target
Name:
Tyrosine-protein phosphatase non-receptor type 22
Synonyms:
3.1.3.48 LyP Lymphoid phosphatase (Lyp) PEST-domain phosphatase PTPN22 Tyrosine-protein phosphatase non-receptor type 22 (LYP) | tyrosine-protein phosphatase non-receptor type 22 isoform 1
Type:
Mol. Mass.:
91712.31
Organism:
Homo sapiens (Human)
Description:
Q9Y2R2
Residue:
807
  
Inhibitor
Name:
BDBM65965
Synonyms:
2-[4-[2-(4-chloranylphenoxy)ethanoylamino]phenoxy]ethanoic acid 2-[4-[[2-(4-chlorophenoxy)acetyl]amino]phenoxy]acetic acid cid_893991
Type:
Small organic molecule
Emp. Form.:
C16H14ClNO5
Mol. Mass.:
335.739
SMILES:
OC(=O)COc1ccc(NC(=O)COc2ccc(Cl)cc2)cc1
: