Target
Tyrosine-protein phosphatase non-receptor type 22
Ligand
BDBM48802
Substrate
Meas. Tech.
SAR LYP1 Fluorescent Assay using OMFP substrate for In Vitro dose response studies - Set 2
IC50
5130±n/a nM
Citation
 PubChem, PC SAR LYP1 Fluorescent Assay using OMFP substrate for In Vitro dose response studies - Set 2 PubChem Bioassay (2010)[AID] 
Target
Name:
Tyrosine-protein phosphatase non-receptor type 22
Synonyms:
3.1.3.48 LyP Lymphoid phosphatase (Lyp) PEST-domain phosphatase PTPN22 Tyrosine-protein phosphatase non-receptor type 22 (LYP) | tyrosine-protein phosphatase non-receptor type 22 isoform 1
Type:
Mol. Mass.:
91712.31
Organism:
Homo sapiens (Human)
Description:
Q9Y2R2
Residue:
807
  
Inhibitor
Name:
BDBM48802
Synonyms:
2-[2-ethoxy-4-[[[4-[2-(4-methylanilino)-1,3-thiazol-4-yl]benzoyl]hydrazinylidene]methyl]phenoxy]acetic acid 2-[2-ethoxy-4-[[[4-[2-[(4-methylphenyl)amino]-1,3-thiazol-4-yl]phenyl]carbonylhydrazinylidene]methyl]phenoxy]ethanoic acid MLS000713540 cid_3143475
Type:
Small organic molecule
Emp. Form.:
C28H26N4O5S
Mol. Mass.:
530.595
SMILES:
CCOc1cc(C=NNC(=O)c2ccc(cc2)-c2csc(Nc3ccc(C)cc3)n2)ccc1OCC(O)=O
: