Target
Tyrosine-protein phosphatase non-receptor type 22
Ligand
BDBM65967
Substrate
Meas. Tech.
SAR LYP1 Fluorescent Assay using OMFP substrate for In Vitro dose response studies - Set 2
IC50
>100000±n/a nM
Citation
 PubChem, PC SAR LYP1 Fluorescent Assay using OMFP substrate for In Vitro dose response studies - Set 2 PubChem Bioassay (2010)[AID] 
Target
Name:
Tyrosine-protein phosphatase non-receptor type 22
Synonyms:
3.1.3.48 LyP Lymphoid phosphatase (Lyp) PEST-domain phosphatase PTPN22 Tyrosine-protein phosphatase non-receptor type 22 (LYP) | tyrosine-protein phosphatase non-receptor type 22 isoform 1
Type:
Mol. Mass.:
91712.31
Organism:
Homo sapiens (Human)
Description:
Q9Y2R2
Residue:
807
  
Inhibitor
Name:
BDBM65967
Synonyms:
2-[(2Z)-3-keto-2-(2-thenylidene)coumaran-6-yl]oxyacetic acid 2-[[(2Z)-3-oxo-2-(thiophen-2-ylmethylidene)-1-benzofuran-6-yl]oxy]acetic acid MLS-0308342.0001 | cid_1944908
Type:
Small organic molecule
Emp. Form.:
C15H10O5S
Mol. Mass.:
302.302
SMILES:
OC(=O)COc1ccc2C(=O)\C(Oc2c1)=C\c1cccs1
: