Target
Alkanal monooxygenase alpha chain
Ligand
BDBM65976
Substrate
Meas. Tech.
Absorbance Microorganism Dose Retest to Identify Inhibitors of Vibrio harveyi
EC50
>160000±n/a nM
Citation
 PubChem, PC Absorbance Microorganism Dose Retest to Identify Inhibitors of Vibrio harveyi PubChem Bioassay (2010)[AID] 
Target
Name:
Alkanal monooxygenase alpha chain
Synonyms:
Bacterial luciferase alpha chain luxA
Type:
Enzyme Catalytic Domain
Mol. Mass.:
40139.12
Organism:
Vibrio harveyi
Description:
gi_126509
Residue:
355
  
Inhibitor
Name:
BDBM65976
Synonyms:
MLS000099320 N-(6-methyl-2-pyridyl)-4-phenoxy-benzenesulfonamide N-(6-methylpyridin-2-yl)-4-phenoxybenzenesulfonamide cid_801216
Type:
Small organic molecule
Emp. Form.:
C18H16N2O3S
Mol. Mass.:
340.396
SMILES:
Cc1cccc(NS(=O)(=O)c2ccc(Oc3ccccc3)cc2)n1
: