Target
S-ribosylhomocysteine lyase
Ligand
BDBM65979
Substrate
Meas. Tech.
Absorbance Microorganism-Based Dose Retest to Identify Inhibitors of Vibrio harveyi
EC50
>160000±n/a nM
Citation
 PubChem, PC Absorbance Microorganism-Based Dose Retest to Identify Inhibitors of Vibrio harveyi PubChem Bioassay (2010)[AID] 
Target
Name:
S-ribosylhomocysteine lyase
Synonyms:
LuxS
Type:
Enzyme Catalytic Domain
Mol. Mass.:
15564.06
Organism:
Vibrio harveyi
Description:
B0LUE4
Residue:
140
  
Inhibitor
Name:
BDBM65979
Synonyms:
1-methyl-N-[4-(trifluoromethoxy)phenyl]-1H-imidazole-4-sulfonamide 1-methyl-N-[4-(trifluoromethoxy)phenyl]imidazole-4-sulfonamide MLS000673272 cid_2821584
Type:
Small organic molecule
Emp. Form.:
C11H10F3N3O3S
Mol. Mass.:
321.276
SMILES:
Cn1cnc(c1)S(=O)(=O)Nc1ccc(OC(F)(F)F)cc1
: