Target
Vacuolar aminopeptidase 1
Ligand
BDBM43596
Substrate
Meas. Tech.
Dose Response of TOR pathway GFP-fusion proteins in Saccharomyes cerevisiae specifically LAP4 based on MLPCN hits
EC50
5590±n/a nM
Citation
 PubChem, PC Dose Response of TOR pathway GFP-fusion proteins in Saccharomyes cerevisiae specifically LAP4 based on MLPCN hits PubChem Bioassay (2010)[AID] 
Target
Name:
Vacuolar aminopeptidase 1
Synonyms:
AMPL_YEAST API YSC1
Type:
Enzyme Catalytic Domain
Mol. Mass.:
57084.90
Organism:
Saccharomyces cerevisiae
Description:
gi_486173
Residue:
514
  
Inhibitor
Name:
BDBM43596
Synonyms:
(3Z)-3-[2-keto-2-(2-thienyl)ethylidene]-7-methyl-oxindole (3Z)-7-methyl-3-(2-oxo-2-thiophen-2-ylethylidene)-1H-indol-2-one MLS000594194 cid_2199592
Type:
Small organic molecule
Emp. Form.:
C15H11NO2S
Mol. Mass.:
269.318
SMILES:
Cc1cccc2\C(=C\C(=O)c3cccs3)C(=O)Nc12
: