Target
Vacuolar aminopeptidase 1
Ligand
BDBM65984
Substrate
Meas. Tech.
Dose Response of TOR pathway GFP-fusion proteins in Saccharomyes cerevisiae specifically LAP4 based on MLPCN hits
EC50
4397±n/a nM
Citation
 PubChem, PC Dose Response of TOR pathway GFP-fusion proteins in Saccharomyes cerevisiae specifically LAP4 based on MLPCN hits PubChem Bioassay (2010)[AID] 
Target
Name:
Vacuolar aminopeptidase 1
Synonyms:
AMPL_YEAST API YSC1
Type:
Enzyme Catalytic Domain
Mol. Mass.:
57084.90
Organism:
Saccharomyces cerevisiae
Description:
gi_486173
Residue:
514
  
Inhibitor
Name:
BDBM65984
Synonyms:
MLS000534613 SMR000142050 [(Z)-[1-azanyl-2-(4-chlorophenyl)ethylidene]amino] benzoate cid_5893661
Type:
Small organic molecule
Emp. Form.:
C15H13ClN2O2
Mol. Mass.:
288.729
SMILES:
NC(Cc1ccc(Cl)cc1)=NOC(=O)c1ccccc1
: