Target
Vacuolar aminopeptidase 1
Ligand
BDBM57360
Substrate
Meas. Tech.
Dose Response of TOR pathway GFP-fusion proteins in Saccharomyes cerevisiae specifically LAP4 based on MLPCN hits
EC50
3330±n/a nM
Citation
 PubChem, PC Dose Response of TOR pathway GFP-fusion proteins in Saccharomyes cerevisiae specifically LAP4 based on MLPCN hits PubChem Bioassay (2010)[AID] 
Target
Name:
Vacuolar aminopeptidase 1
Synonyms:
AMPL_YEAST API YSC1
Type:
Enzyme Catalytic Domain
Mol. Mass.:
57084.90
Organism:
Saccharomyces cerevisiae
Description:
gi_486173
Residue:
514
  
Inhibitor
Name:
BDBM57360
Synonyms:
(6E)-4-chloranyl-2-nitro-6-[(2-pyridin-2-ylhydrazinyl)methylidene]cyclohexa-2,4-dien-1-one (6E)-4-chloro-2-nitro-6-[(2-pyridinylhydrazo)methylidene]-1-cyclohexa-2,4-dienone 5-chloro-2-hydroxy-3-nitrobenzaldehyde 2-pyridinylhydrazone SMR000162003 | cid_6042139
Type:
Small organic molecule
Emp. Form.:
C12H9ClN4O3
Mol. Mass.:
292.678
SMILES:
[O-][N+](=O)c1cc(Cl)c[c-](C[NH+]=Nc2ccccn2)c1=O
: