Target
Vacuolar aminopeptidase 1
Ligand
BDBM32851
Substrate
Meas. Tech.
Dose Response of TOR pathway GFP-fusion proteins in Saccharomyes cerevisiae specifically LAP4 based on MLPCN hits
EC50
3115±n/a nM
Citation
 PubChem, PC Dose Response of TOR pathway GFP-fusion proteins in Saccharomyes cerevisiae specifically LAP4 based on MLPCN hits PubChem Bioassay (2010)[AID] 
Target
Name:
Vacuolar aminopeptidase 1
Synonyms:
AMPL_YEAST API YSC1
Type:
Enzyme Catalytic Domain
Mol. Mass.:
57084.90
Organism:
Saccharomyces cerevisiae
Description:
gi_486173
Residue:
514
  
Inhibitor
Name:
BDBM32851
Synonyms:
(1,3-dioxoisoindol-2-yl) 2,4,5-trimethylbenzenesulfonate 2,4,5-trimethylbenzenesulfonic acid phthalimido ester MLS000577081 [1,3-bis(oxidanylidene)isoindol-2-yl] 2,4,5-trimethylbenzenesulfonate | cid_1582613
Type:
Small organic molecule
Emp. Form.:
C17H15NO5S
Mol. Mass.:
345.37
SMILES:
Cc1cc(C)c(cc1C)S(=O)(=O)ON1C(=O)c2ccccc2C1=O
: