Target
Vacuolar aminopeptidase 1
Ligand
BDBM66027
Substrate
Meas. Tech.
Dose Response of TOR pathway GFP-fusion proteins in Saccharomyes cerevisiae specifically LAP4 based on MLPCN hits
EC50
11410±n/a nM
Citation
 PubChem, PC Dose Response of TOR pathway GFP-fusion proteins in Saccharomyes cerevisiae specifically LAP4 based on MLPCN hits PubChem Bioassay (2010)[AID] 
Target
Name:
Vacuolar aminopeptidase 1
Synonyms:
AMPL_YEAST API YSC1
Type:
Enzyme Catalytic Domain
Mol. Mass.:
57084.90
Organism:
Saccharomyces cerevisiae
Description:
gi_486173
Residue:
514
  
Inhibitor
Name:
BDBM66027
Synonyms:
(4-bromophenyl)-[4-(4-methoxy-2-nitro-phenyl)piperazin-1-yl]methanone (4-bromophenyl)-[4-(4-methoxy-2-nitrophenyl)-1-piperazinyl]methanone 1-(4-bromobenzoyl)-4-(4-methoxy-2-nitrophenyl)piperazine SMR000296120 | cid_2973383
Type:
Small organic molecule
Emp. Form.:
C18H18BrN3O4
Mol. Mass.:
420.257
SMILES:
COc1ccc(N2CCN(CC2)C(=O)c2ccc(Br)cc2)c(c1)[N+]([O-])=O
: