Target
Vacuolar aminopeptidase 1
Ligand
BDBM47478
Substrate
Meas. Tech.
Dose Response of TOR pathway GFP-fusion proteins in Saccharomyes cerevisiae specifically LAP4 based on MLPCN hits
EC50
1987±n/a nM
Citation
 PubChem, PC Dose Response of TOR pathway GFP-fusion proteins in Saccharomyes cerevisiae specifically LAP4 based on MLPCN hits PubChem Bioassay (2010)[AID] 
Target
Name:
Vacuolar aminopeptidase 1
Synonyms:
AMPL_YEAST API YSC1
Type:
Enzyme Catalytic Domain
Mol. Mass.:
57084.90
Organism:
Saccharomyces cerevisiae
Description:
gi_486173
Residue:
514
  
Inhibitor
Name:
BDBM47478
Synonyms:
2-(4-chlorophenyl)sulfonyl-6-methoxy-3-nitro-pyridine 2-[(4-chlorophenyl)sulfonyl]-6-methoxy-3-nitropyridine SMR000457307 | cid_2801235
Type:
Small organic molecule
Emp. Form.:
C12H9ClN2O5S
Mol. Mass.:
328.728
SMILES:
COc1ccc(c(n1)S(=O)(=O)c1ccc(Cl)cc1)[N+]([O-])=O
: