Target
Vacuolar aminopeptidase 1
Ligand
BDBM66070
Substrate
Meas. Tech.
Dose Response of TOR pathway GFP-fusion proteins in Saccharomyes cerevisiae specifically LAP4 based on MLPCN hits
EC50
2000±n/a nM
Citation
 PubChem, PC Dose Response of TOR pathway GFP-fusion proteins in Saccharomyes cerevisiae specifically LAP4 based on MLPCN hits PubChem Bioassay (2010)[AID] 
Target
Name:
Vacuolar aminopeptidase 1
Synonyms:
AMPL_YEAST API YSC1
Type:
Enzyme Catalytic Domain
Mol. Mass.:
57084.90
Organism:
Saccharomyces cerevisiae
Description:
gi_486173
Residue:
514
  
Inhibitor
Name:
BDBM66070
Synonyms:
1-(2-benzoylphenyl)-2,5-dihydro-1H-pyrrole-2,5-dione 1-(2-benzoylphenyl)pyrrole-2,5-dione MLS000861680 cid_2731237
Type:
Small organic molecule
Emp. Form.:
C17H11NO3
Mol. Mass.:
277.2741
SMILES:
O=C(c1ccccc1)c1ccccc1N1C(=O)C=CC1=O
: