Target
NADPH oxidase 1
Ligand
BDBM66096
Substrate
Meas. Tech.
Late-stage luminescence-based cell-based dose response assay to identify inhibitors of NADPH oxidase 1 (NOX1): Synthesized analogs 2
IC50
>50000±n/a nM
Citation
 PubChem, PC Late-stage luminescence-based cell-based dose response assay to identify inhibitors of NADPH oxidase 1 (NOX1): Synthesized analogs 2 PubChem Bioassay (2010)[AID] 
Target
Name:
NADPH oxidase 1
Synonyms:
MOX-1 Mitogenic oxidase 1 NOH-1 NOX-1 NOX1_HUMAN
Type:
PROTEIN
Mol. Mass.:
64890.44
Organism:
Homo sapiens (Human)
Description:
ChEMBL_792877
Residue:
564
  
Inhibitor
Name:
BDBM66096
Synonyms:
3-bromanyl-10-methyl-phenothiazine 3-bromo-10-methylphenothiazine SR-03000001198-1 | cid_638529
Type:
Small organic molecule
Emp. Form.:
C13H10BrNS
Mol. Mass.:
292.194
SMILES:
CN1c2ccccc2Sc2cc(Br)ccc12
: